Re: More uml build failures on 2.16.19-rc3 and 2.6.18.1

[Date Prev][Date Next][Thread Prev][Thread Next][Date Index][Thread Index]

 



Maybe my compiler. Anyone building with 4.0.3 ?

home /usr/src/sources/kernel/linux-2.6.18% make ARCH=um CC=gcc\ -v
Using built-in specs.
  SYMLINK arch/um/include/kern_constants.h
  CC      arch/um/sys-i386/user-offsets.s
Using built-in specs.
Target: i686-linux
Configured with: ../gcc-4.0.3/configure --disable-static --prefix=/usr --disable-nls --with-system-zlib i686-linux
Thread model: posix
gcc version 4.0.3
/usr/libexec/gcc/i686-linux/4.0.3/cc1 -quiet -v -Iarch/um/include -I/usr/src/sources/kernel/linux-2.6.18/arch/um/include/skas -D__arch_um__ -DSUBARCH="i386" -Dvmap=kernel_vmap -Din6addr_loopback=kernel_in6addr_loopback -D_FILE_OFFSET_BITS=64 -D_GNU_SOURCE -D_LARGEFILE64_SOURCE -MD arch/um/sys-i386/.user-offsets.s.d arch/um/sys-i386/user-offsets.c -quiet -dumpbase user-offsets.c -march=i686 -mpreferred-stack-boundary=2 -auxbase-strip arch/um/sys-i386/user-offsets.s -Os -Wall -Wundef -Wstrict-prototypes -Wno-trigraphs -version -fno-strict-aliasing -fno-common -ffreestanding -fverbose-asm -o arch/um/sys-i386/user-offsets.s
ignoring nonexistent directory "/usr/local/include"
ignoring nonexistent directory "/usr/lib/gcc/i686-linux/4.0.3/../../../../i686-linux/include"
#include "..." search starts here:
#include <...> search starts here:
 arch/um/include
 /usr/src/sources/kernel/linux-2.6.18/arch/um/include/skas
 /usr/lib/gcc/i686-linux/4.0.3/include
 /usr/include
End of search list.
GNU C version 4.0.3 (i686-linux)
        compiled by GNU C version 3.4.6.
GGC heuristics: --param ggc-min-expand=100 --param ggc-min-heapsize=131072
arch/um/sys-i386/user-offsets.c: In function 'foo':
arch/um/sys-i386/user-offsets.c:19: warning: implicit declaration of function 'offsetof'
arch/um/sys-i386/user-offsets.c:19: error: syntax error before 'struct'
arch/um/sys-i386/user-offsets.c:20: error: syntax error before 'struct'
arch/um/sys-i386/user-offsets.c:21: error: syntax error before 'struct'
arch/um/sys-i386/user-offsets.c:22: error: syntax error before 'struct'
arch/um/sys-i386/user-offsets.c:23: error: syntax error before 'struct'
arch/um/sys-i386/user-offsets.c:24: error: syntax error before 'struct'
arch/um/sys-i386/user-offsets.c:25: error: syntax error before 'struct'
arch/um/sys-i386/user-offsets.c:26: error: syntax error before 'struct'
arch/um/sys-i386/user-offsets.c:27: error: syntax error before 'struct'
arch/um/sys-i386/user-offsets.c:28: error: syntax error before 'struct'
arch/um/sys-i386/user-offsets.c:29: error: syntax error before 'struct'
arch/um/sys-i386/user-offsets.c:30: error: syntax error before 'struct'
arch/um/sys-i386/user-offsets.c:31: error: syntax error before 'struct'
arch/um/sys-i386/user-offsets.c:32: error: syntax error before 'struct'
arch/um/sys-i386/user-offsets.c:33: error: syntax error before 'struct'
arch/um/sys-i386/user-offsets.c:34: error: syntax error before 'struct'
arch/um/sys-i386/user-offsets.c:35: error: syntax error before 'struct'
arch/um/sys-i386/user-offsets.c:36: error: syntax error before 'struct'
arch/um/sys-i386/user-offsets.c:37: error: syntax error before 'struct'
arch/um/sys-i386/user-offsets.c:38: error: syntax error before 'struct'
arch/um/sys-i386/user-offsets.c:39: error: syntax error before 'struct'
arch/um/sys-i386/user-offsets.c:40: error: syntax error before 'struct'
arch/um/sys-i386/user-offsets.c:41: error: syntax error before 'struct'
arch/um/sys-i386/user-offsets.c:42: error: syntax error before 'struct'
arch/um/sys-i386/user-offsets.c:43: error: syntax error before 'struct'
arch/um/sys-i386/user-offsets.c:44: error: syntax error before 'struct'
arch/um/sys-i386/user-offsets.c:45: error: syntax error before 'struct'
arch/um/sys-i386/user-offsets.c:46: error: syntax error before 'struct'
arch/um/sys-i386/user-offsets.c:47: error: syntax error before 'struct'
arch/um/sys-i386/user-offsets.c:48: error: syntax error before 'struct'
make[1]: *** [arch/um/sys-i386/user-offsets.s] Error 1
make: *** [arch/um/sys-i386/user-offsets.s] Error 2
The mail in /var/mail/mitch has been read.
home /usr/src/sources/kernel/linux-2.6.18%




-------- Original Message --------
Subject: Re: [Fwd: Re: More uml build failures on 2.16.19-rc3 and 2.6.18.1]
Date: Tue, 24 Oct 2006 11:31:06 +0300
From: Pekka Enberg <[email protected]>
To: Mitch <[email protected]>
CC: [email protected], [email protected]
References: <[email protected]>

Hi,

On 10/24/06, Mitch <[email protected]> wrote:
Yup, did do 'make mrproper'. config attached.
Works for me. Perhaps the UML people can figure out what's going on.

                                    Pekka
-
To unsubscribe from this list: send the line "unsubscribe linux-kernel" in
the body of a message to [email protected]
More majordomo info at  http://vger.kernel.org/majordomo-info.html
Please read the FAQ at  http://www.tux.org/lkml/

[Index of Archives]     [Kernel Newbies]     [Netfilter]     [Bugtraq]     [Photo]     [Stuff]     [Gimp]     [Yosemite News]     [MIPS Linux]     [ARM Linux]     [Linux Security]     [Linux RAID]     [Video 4 Linux]     [Linux for the blind]     [Linux Resources]
  Powered by Linux